SmartDevices (Smart Devices) Generation Success========== DeveloperMenu Compilation for Android (Android) started ==========callmake.bat "E:\KBs\Tilo\PurchaseOrdersSalesOffline\CS\mobile\Android\gxcommon\GXAMake.exe" "C:\Program Files\Java\jdk1.7.0_45\bin\javac.exe" developermenu options:GeneXus Java Make v1.0SdtPurchaseOrder_Detail.java is unavailableSdtPurchaseOrder.java is unavailableSdtDevice.java is unavailablewarning: [options] bootstrap class path not set in conjunction with -source 1.6createpurchaseorder.java:151: error: cannot find symbolprivate SdtPurchaseOrder AV9PurchaseOrder ;^symbol: class SdtPurchaseOrderlocation: class createpurchaseordercreatepurchaseorder.java:155: error: cannot find symbolprivate SdtPurchaseOrder_Detail AV10PurchaseOrderDetail ;^symbol: class SdtPurchaseOrder_Detaillocation: class createpurchaseordersavedeviceid.java:131: error: cannot find symbolprivate SdtDevice AV8Device ;^symbol: class SdtDevicelocation: class savedeviceidcreatepurchaseorder.java:106: error: cannot find symbolAV10PurchaseOrderDetail = (SdtPurchaseOrder_Detail)new SdtPurchaseOrder_Detail( remoteHandle, context);^symbol: class SdtPurchaseOrder_Detaillocation: class createpurchaseordercreatepurchaseorder.java:106: error: cannot find symbolAV10PurchaseOrderDetail = (SdtPurchaseOrder_Detail)new SdtPurchaseOrder_Detail( remoteHandle, context);^symbol: class SdtPurchaseOrder_Detaillocation: class createpurchaseordercreatepurchaseorder.java:135: error: cannot find symbolAV9PurchaseOrder = new SdtPurchaseOrder(remoteHandle);^symbol: class SdtPurchaseOrderlocation: class createpurchaseordercreatepurchaseorder.java:137: error: cannot find symbolAV10PurchaseOrderDetail = new SdtPurchaseOrder_Detail(remoteHandle);^symbol: class SdtPurchaseOrder_Detaillocation: class createpurchaseordersavedeviceid.java:85: error: cannot find symbolAV8Device = (SdtDevice)new SdtDevice( remoteHandle, context);^symbol: class SdtDevicelocation: class savedeviceidsavedeviceid.java:85: error: cannot find symbolAV8Device = (SdtDevice)new SdtDevice( remoteHandle, context);^symbol: class SdtDevicelocation: class savedeviceidsavedeviceid.java:112: error: cannot find symbolAV8Device = new SdtDevice(remoteHandle);^symbol: class SdtDevicelocation: class savedeviceidNote: Some input files use unchecked or unsafe operations.Note: Recompile with -Xlint:unchecked for details.10 errors1 warning
failed ( error code=1)Build failed.DeveloperMenu Compilation for Android (Android) Failed========== DeveloperMenu Compilation for Default (C# Web) started ==========gxexec "E:\KBs\Tilo\PurchaseOrdersSalesOffline\CS\web\bldDevelopermenu.cs" -r:GxBaseBuilder.dll -arg:csc="C:\Windows\Microsoft.NET\Framework\v3.5\csc.exe"Building bin\GeneXus.Programs.Common.dllCompilador de Microsoft (R) Visual C# 2008, versión 3.5.30729.5420para Microsoft (R) .NET Framework, versión 3.5(C) Microsoft Corporation. Reservados todos los derechos.Compiling sdsvc_gx0020sd_level_detail...successCompiling sdsvc_workwithdevicescustomer_customer_list...successCompiling sdsvc_workwithdevicescustomer_customer_section_general...successCompiling purchaseordersofflineofflinedatabase...successCompiling sdsvc_workwithdevicespurchaseorder_purchaseorder_list...successCompiling sdsvc_workwithdevicespurchaseorder_detail_section_general...successCompiling sdsvc_workwithdevicespurchaseorder_purchaseorder_section_detail...successCompiling workwithdevicescustomer_customer_list_grid1...successCompiling workwithdevicescustomer_customer_section_general...successCompiling workwithdevicescustomer_customer_section_purchaseorder_grid1...successCompiling workwithdevicescustomer_customer_detail...successCompiling workwithdevicespurchaseorder_purchaseorder_list_grid1...successCompiling workwithdevicespurchaseorder_purchaseorder_section_general...successCompiling workwithdevicespurchaseorder_purchaseorder_detail...successCompiling workwithdevicespurchaseorder_purchaseorder_section_detail_grid1...successCompiling workwithdevicespurchaseorder_detail_detail...successCompiling workwithdevicespurchaseorder_detail_section_general...successCompiling createpurchaseorder...successCompiling savedeviceid...successDeveloperMenu Compilation for Default (C# Web) Success========== Web config update started ==========Updating web config ...Web config update SuccessRun PurchaseOrdersOffline Failed
--
Saludos,Has recibido este mensaje porque estás suscrito al grupo "GeneXus" de Grupos de Google.
Para anular la suscripción a este grupo y dejar de recibir sus mensajes, envía un correo electrónico a genexus+unsubscribe@googlegroups.com.
Para acceder a más opciones, visita https://groups.google.com/d/optout.
0 Response to "error: cannot find symbol private SdtPurchaseOrder AV9PurchaseOrder ;"
Publicar un comentario